{"text_format":"3","workbook":"xlsx","n_sheets":4,"sheets":["list","data","Лист1","Лист2"],"not_rendered":{"defined_names":8},"read":"whole","date_system":"1900"}

{"sheet":"list","index":0,"n_rows":143,"n_cols":16,"rows_kept":143}
["№","СНИЛС","Фамилия","Имя","Отчество","Пол","Дата рождения","Участник с ОВЗ","Класс","Класс участия","Балл","Макс. Балл","Статус","Призер МЭ прошлого года","Учитель","Место работы учителя"]
[1,2,3,4,5,6,7,8,9,10,11,12,13,14,15,16]
[1,16995725647,"Гатин","Самат","Ленарович","М","2011-12-06","нет",5,5,4,8,"призер","нет","ХуснутдиноваГелюся Галияхматовна","Муниципальное бюджетное общеобразовательное учреждение \"Гимназия №2\" г.Нижнекамска Республики Татарстан"]
[2,17305576063,"Суфиянов","Расул","Ильмирович","М","2012-07-24","нет",5,5,4,8,"призер","нет","ХуснутдиноваГелюся Галияхматовна","Муниципальное бюджетное общеобразовательное учреждение \"Гимназия №2\" г.Нижнекамска Республики Татарстан"]
[3,17070094950,"Исхаков","Амир","Айратович","М","2012-02-16","нет",5,5,4,8,"призер","нет","Кинзябулатова Энзе Ильдусовна","Муниципальное бюджетное общеобразовательное учреждение \"Гимназия №2\" г.Нижнекамска Республики Татарстан"]
[4,16964708321,"Шафиков","Амир","Айратович","М","2011-12-04","нет",5,5,3,8,"Участник","нет","Иванова Лейсан Фархатовна","Муниципальное бюджетное общеобразовательное учреждение \"Гимназия №2\" г.Нижнекамска Республики Татарстан"]
[5,17395853117,"Харитонова","Полина","Александровна","Ж","2012-10-02","нет",5,5,3,8,"Участник","нет","ХуснутдиноваГелюся Галияхматовна","Муниципальное бюджетное общеобразовательное учреждение \"Гимназия №2\" г.Нижнекамска Республики Татарстан"]
[6,17409353777,"Биктяшова","Самира","Юрьевна","Ж","18.10.2012","нет",5,5,2,8,"Участник","нет","ХуснутдиноваГелюся Галияхматовна","Муниципальное бюджетное общеобразовательное учреждение \"Гимназия №2\" г.Нижнекамска Республики Татарстан"]
[7,16971500591,"Мубаракшина","Регина","Рамисовна","Ж","07.12.2011","нет",5,5,2,8,"Участник","нет","ХуснутдиноваГелюся Галияхматовна","Муниципальное бюджетное общеобразовательное учреждение \"Гимназия №2\" г.Нижнекамска Республики Татарстан"]
[8,"16995723643","Алексеева","Маргарита","Денисовна","Ж","29.12.2011","нет",5,5,2,8,"Участник","нет","Иванова Лейсан Фархатовна","Муниципальное бюджетное общеобразовательное учреждение \"Гимназия №2\" г.Нижнекамска Республики Татарстан"]
[9,17196440992,"Гайфутдинов","Радмир","Ирекович","М","2012-04-21","нет",5,5,2,8,"Участник","нет","Кинзябулатова Энзе Ильдусовна","Муниципальное бюджетное общеобразовательное учреждение \"Гимназия №2\" г.Нижнекамска Республики Татарстан"]
[10,17316415353,"Нафиков","Данис","Рамисович","М","2012-07-31","нет",5,5,2,8,"Участник","нет","Кинзябулатова Энзе Ильдусовна","Муниципальное бюджетное общеобразовательное учреждение \"Гимназия №2\" г.Нижнекамска Республики Татарстан"]
[11,17031097432,"Тухватуллина","Альмира","Рамилевна","Ж","2012-01-22","нет",5,5,2,8,"Участник","нет","Кинзябулатова Энзе Ильдусовна","Муниципальное бюджетное общеобразовательное учреждение \"Гимназия №2\" г.Нижнекамска Республики Татарстан"]
[12,16998185252,"Бикбова","Диляра","Азатовна","Ж","2012-01-07","нет",5,5,1,8,"Участник","нет","ХуснутдиноваГелюся Галияхматовна","Муниципальное бюджетное общеобразовательное учреждение \"Гимназия №2\" г.Нижнекамска Республики Татарстан"]
[13,16924804091,"Набиева","Зарина","Руслановна","Ж","16.11.2011","нет",5,5,1,8,"Участник","нет","ХуснутдиноваГелюся Галияхматовна","Муниципальное бюджетное общеобразовательное учреждение \"Гимназия №2\" г.Нижнекамска Республики Татарстан"]
[14,17298853832,"Хакимова","Руфина","Динаровна","Ж","2012-07-14","нет",5,5,1,8,"Участник","нет","ХуснутдиноваГелюся Галияхматовна","Муниципальное бюджетное общеобразовательное учреждение \"Гимназия №2\" г.Нижнекамска Республики Татарстан"]
[15,17132286043,"Хакимов","Айнур","Раушанович","М","27.03.2012","нет",5,5,1,8,"Участник","нет","ХуснутдиноваГелюся Галияхматовна","Муниципальное бюджетное общеобразовательное учреждение \"Гимназия №2\" г.Нижнекамска Республики Татарстан"]
[16,17354139874,"Нафикова","Динара","Ильдаровна","Ж","2012-09-03","нет",5,5,1,8,"Участник","нет","ХуснутдиноваГелюся Галияхматовна","Муниципальное бюджетное общеобразовательное учреждение \"Гимназия №2\" г.Нижнекамска Республики Татарстан"]
[17,17274649600,"Хакимов","Нурислам","Рамисович","М","2012-06-21","нет",5,5,1,8,"Участник","нет","ХуснутдиноваГелюся Галияхматовна","Муниципальное бюджетное общеобразовательное учреждение \"Гимназия №2\" г.Нижнекамска Республики Татарстан"]
[18,16995723946,"Габдуллина","Ясмина","Фанисовна","Ж","2012-01-13","нет",5,5,1,8,"Участник","нет","Кинзябулатова Энзе Ильдусовна","Муниципальное бюджетное общеобразовательное учреждение \"Гимназия №2\" г.Нижнекамска Республики Татарстан"]
[19,17371475584,"Гильфанова","Эмилия","Ленаровна","Ж","2012-09-14","нет",5,5,1,8,"Участник","нет","Кинзябулатова Энзе Ильдусовна","Муниципальное бюджетное общеобразовательное учреждение \"Гимназия №2\" г.Нижнекамска Республики Татарстан"]
[20,"17369145294","Ахметов ","Данияз","Алмазович","М","2012-08-31","нет",5,5,0,8,"Участник","нет","ХуснутдиноваГелюся Галияхматовна","Муниципальное бюджетное общеобразовательное учреждение \"Гимназия №2\" г.Нижнекамска Республики Татарстан"]
[21,17377224185,"Гарифуллина","Амиля","Альбертовна","Ж","2012-09-09","нет",5,5,0,8,"Участник","нет","ХуснутдиноваГелюся Галияхматовна","Муниципальное бюджетное общеобразовательное учреждение \"Гимназия №2\" г.Нижнекамска Республики Татарстан"]
[22,17152040629,"Набиева","Алия","Нургаязовна","Ж","01.04.2012","нет",5,5,0,8,"Участник","нет","ХуснутдиноваГелюся Галияхматовна","Муниципальное бюджетное общеобразовательное учреждение \"Гимназия №2\" г.Нижнекамска Республики Татарстан"]
[23,17040560935,"Миннегалиева","Альмира","Альбертовна","Ж","19.01.2012","нет",5,5,0,8,"Участник","нет","ХуснутдиноваГелюся Галияхматовна","Муниципальное бюджетное общеобразовательное учреждение \"Гимназия №2\" г.Нижнекамска Республики Татарстан"]
[24,17385473606,"Вилданов","Наиль","Маратович","М","2012-09-30","нет",5,5,0,8,"Участник","нет","Иванова Лейсан Фархатовна","Муниципальное бюджетное общеобразовательное учреждение \"Гимназия №2\" г.Нижнекамска Республики Татарстан"]
[25,17216504648,"Галиев","Азамат","Айратович","М","2012-05-21","нет",5,5,0,8,"Участник","нет","ХуснутдиноваГелюся Галияхматовна","Муниципальное бюджетное общеобразовательное учреждение \"Гимназия №2\" г.Нижнекамска Республики Татарстан"]
[26,17060591049,"Калимуллина","Альбина","Рафисовна","Ж","2012-02-15","нет",5,5,0,8,"Участник","нет","ХуснутдиноваГелюся Галияхматовна","Муниципальное бюджетное общеобразовательное учреждение \"Гимназия №2\" г.Нижнекамска Республики Татарстан"]
[27,16995727550,"Хадиева","Илюза","Ильшатовна","Ж","2011-12-29","нет",5,5,0,8,"Участник","нет","ХуснутдиноваГелюся Галияхматовна","Муниципальное бюджетное общеобразовательное учреждение \"Гимназия №2\" г.Нижнекамска Республики Татарстан"]
[28,17379309001,"Хусаенов","Рамазан","Ренатович","М","2012-09-21","нет",5,5,0,8,"Участник","нет","ХуснутдиноваГелюся Галияхматовна","Муниципальное бюджетное общеобразовательное учреждение \"Гимназия №2\" г.Нижнекамска Республики Татарстан"]
[29,17276181282,"Валиахметов","Амир","Наилевич","М","2012-06-11","нет",5,5,0,8,"Участник","нет","Кинзябулатова Энзе Ильдусовна","Муниципальное бюджетное общеобразовательное учреждение \"Гимназия №2\" г.Нижнекамска Республики Татарстан"]
[30,17166509883,"Сулейманов","Амир","Ренатович","М","2012-04-04","нет",5,5,0,8,"Участник","нет","Кинзябулатова Энзе Ильдусовна","Муниципальное бюджетное общеобразовательное учреждение \"Гимназия №2\" г.Нижнекамска Республики Татарстан"]
[31,17196441590,"Фаттахов","Йусуф","Табрисович","М","2012-04-29","нет",5,5,0,8,"Участник","нет","Кинзябулатова Энзе Ильдусовна","Муниципальное бюджетное общеобразовательное учреждение \"Гимназия №2\" г.Нижнекамска Республики Татарстан"]
[32,17276186797,"Халиков","Муса","Айдарович","М","2012-06-21","нет",5,5,0,8,"Участник","нет","Кинзябулатова Энзе Ильдусовна","Муниципальное бюджетное общеобразовательное учреждение \"Гимназия №2\" г.Нижнекамска Республики Татарстан"]
[33,17140047627,"Хаммадиев","Айрат","Маратович","М","2012-03-31","нет",5,5,0,8,"Участник","нет","Кинзябулатова Энзе Ильдусовна","Муниципальное бюджетное общеобразовательное учреждение \"Гимназия №2\" г.Нижнекамска Республики Татарстан"]
[34,17462936196,"Хурматова","Сайдель","Ранилевна","Ж","2012-11-16","нет",5,5,0,8,"Участник","нет","Кинзябулатова Энзе Ильдусовна","Муниципальное бюджетное общеобразовательное учреждение \"Гимназия №2\" г.Нижнекамска Республики Татарстан"]
[35,16751181575,"Гасимова","Алина","Ильнуровна","Ж","2011-07-10","нет",6,6,6,8,"Победитель","нет","Кинзябулатова Энзе Ильдусовна","Муниципальное бюджетное общеобразовательное учреждение \"Гимназия №2\" г.Нижнекамска Республики Татарстан"]
[36,16293884709,"Сафина","Амина","Ильясовна","Ж","2010-11-15","нет",6,6,5,8,"Призер","нет","Иванова Лейсан Фархатовна","Муниципальное бюджетное общеобразовательное учреждение \"Гимназия №2\" г.Нижнекамска Республики Татарстан"]
[37,16447844297,"Метрухина","Диана","Руслановна","Ж","2011-03-10","нет",6,6,4,8,"Призер","нет","Ибрагимова Ксения Радиковна ","Муниципальное бюджетное общеобразовательное учреждение \"Гимназия №2\" г.Нижнекамска Республики Татарстан"]
[38,16465763097,"Шаманский","Александр","Егорович","М","2011-03-10","нет",6,6,3,8,"Участник","нет","Кинзябулатова Энзе Ильдусовна","Муниципальное бюджетное общеобразовательное учреждение \"Гимназия №2\" г.Нижнекамска Республики Татарстан"]
[39,16379101878,"Сахапова","Зарина","Алмазовна","Ж","2010-12-26","нет",6,6,2,8,"Участник","нет","Кинзябулатова Энзе Ильдусовна","Муниципальное бюджетное общеобразовательное учреждение \"Гимназия №2\" г.Нижнекамска Республики Татарстан"]
[40,16952854316,"Хамидуллина","Руфина","Ильдаровна","Ж","2011-09-23","нет",6,6,2,8,"Участник","нет","Кинзябулатова Энзе Ильдусовна","Муниципальное бюджетное общеобразовательное учреждение \"Гимназия №2\" г.Нижнекамска Республики Татарстан"]
[41,16599819951,"Гибадуллина","Алина","Ильдаровна","Ж","2011-04-26","нет",6,6,2,8,"Участник","нет","Иванова Лейсан Фархатовна","Муниципальное бюджетное общеобразовательное учреждение \"Гимназия №2\" г.Нижнекамска Республики Татарстан"]
[42,16426116348,"Зиннатуллина","Язиля","Ильшатовна","Ж","2011-02-16","нет",6,6,2,8,"Участник","нет","Иванова Лейсан Фархатовна","Муниципальное бюджетное общеобразовательное учреждение \"Гимназия №2\" г.Нижнекамска Республики Татарстан"]
[43,16500905441,"Набиуллина","Язгуль","Ильгизаровна","Ж","2011-03-21","нет",6,6,2,8,"Участник","нет","Иванова Лейсан Фархатовна","Муниципальное бюджетное общеобразовательное учреждение \"Гимназия №2\" г.Нижнекамска Республики Татарстан"]
[44,16501936760,"Ахмадеева","Зарина","Айдаровна","Ж","2011-02-28","нет",6,6,1,8,"Участник","нет","Кинзябулатова Энзе Ильдусовна","Муниципальное бюджетное общеобразовательное учреждение \"Гимназия №2\" г.Нижнекамска Республики Татарстан"]
[45,16563310562,"Каюмов","Камиль","Русланович","М","2011-04-12","нет",6,6,1,8,"Участник","нет","Кинзябулатова Энзе Ильдусовна","Муниципальное бюджетное общеобразовательное учреждение \"Гимназия №2\" г.Нижнекамска Республики Татарстан"]
[46,16896248940,"Сабиров","Карим","Ильдарович","М","2011-10-19","нет",6,6,1,8,"Участник","нет","Кинзябулатова Энзе Ильдусовна","Муниципальное бюджетное общеобразовательное учреждение \"Гимназия №2\" г.Нижнекамска Республики Татарстан"]
[47,16407940067,"Ахмадишин","Рамазан","Радикович","М","2010-12-17","нет",6,6,1,8,"Участник","нет","Ибрагимова Ксения Радиковна ","Муниципальное бюджетное общеобразовательное учреждение \"Гимназия №2\" г.Нижнекамска Республики Татарстан"]
[48,16563313467,"Ризаев","Тимур","Денисович","М","2011-04-20","нет",6,6,1,8,"Участник","нет","Ибрагимова Ксения Радиковна ","Муниципальное бюджетное общеобразовательное учреждение \"Гимназия №2\" г.Нижнекамска Республики Татарстан"]
[49,16892136202,"Гатиятуллин","Зуфар","Наилевич","М","2011-10-11","нет",6,6,1,8,"Участник","нет","Иванова Лейсан Фархатовна","Муниципальное бюджетное общеобразовательное учреждение \"Гимназия №2\" г.Нижнекамска Республики Татарстан"]
[50,16372946998,"Фарзиев","Азамат","Линарович","М","2010-12-15","нет",6,6,1,8,"Участник","нет","Иванова Лейсан Фархатовна","Муниципальное бюджетное общеобразовательное учреждение \"Гимназия №2\" г.Нижнекамска Республики Татарстан"]
[51,16395103975,"Бадртдинов","Инсаф","Ильдусович","М","2011-01-20","нет",6,6,0,8,"Участник","нет","Кинзябулатова Энзе Ильдусовна","Муниципальное бюджетное общеобразовательное учреждение \"Гимназия №2\" г.Нижнекамска Республики Татарстан"]
[52,16363452366,"Гимадиев","Ирек","Ильшатович","М","2010-12-18","нет",6,6,0,8,"Участник","нет","Ибрагимова Ксения Радиковна ","Муниципальное бюджетное общеобразовательное учреждение \"Гимназия №2\" г.Нижнекамска Республики Татарстан"]
[53,16776938441,"Шарифуллин","Данир","Рафисович","М","2011-08-01","нет",6,6,0,8,"Участник","нет","Иванова Лейсан Фархатовна","Муниципальное бюджетное общеобразовательное учреждение \"Гимназия №2\" г.Нижнекамска Республики Татарстан"]
[54,16065096864,"Фасхутдинов","Искандер","Ильдарович","М","2010-06-06","нет",7,7,3,8,"Участник","нет","Сахабутдинова Саимя Минвалиевна","Муниципальное бюджетное общеобразовательное учреждение \"Гимназия №2\" г.Нижнекамска Республики Татарстан"]
[55,16115694053,"Галлямов","Аскар","Марселевич","М","2010-05-15","нет",7,7,3,8,"Участник","нет","Сахабутдинова Саимя Минвалиевна","Муниципальное бюджетное общеобразовательное учреждение \"Гимназия №2\" г.Нижнекамска Республики Татарстан"]
[56,16470317863,"Гизатуллина","Лейсан","Ленаровна","Ж","21.11.1009","нет",7,7,3,8,"Участник","нет","Сахабутдинова Саимя Минвалиевна","Муниципальное бюджетное общеобразовательное учреждение \"Гимназия №2\" г.Нижнекамска Республики Татарстан"]
[57,16447843800,"Курбангалеева","Руфина","Руслановна","Ж","2010-05-30","нет",7,7,3,8,"Участник","нет","Сахабутдинова Саимя Минвалиевна","Муниципальное бюджетное общеобразовательное учреждение \"Гимназия №2\" г.Нижнекамска Республики Татарстан"]
[58,16206645955,"Хисамеева","Лейсан","Марселевна","Ж","2010-08-26","нет",7,7,2,8,"Участник","нет","Сахабутдинова Саимя Минвалиевна","Муниципальное бюджетное общеобразовательное учреждение \"Гимназия №2\" г.Нижнекамска Республики Татарстан"]
{"$rows_left_out":84}
{"sheet":"data","index":1,"n_rows":25,"n_cols":10,"rows_kept":25}
[{"$nulls":6},"1 - Техника, технология и техническое творчество","2 - Культура дома, дизайн и технологии","3 - Робототехника","4 - Информационная безопасность"]
["1 - Техника, технологии и техническое творчество","1.1  Практика по ручной деревообработке",{"$nulls":4},"1.1 Практика по ручной деревообработке","2.1 Ручная обработка швейного изделия или узла","3.1 Робототехника","4.1 Не предусмотрена"]
["2 - Культура дома, дизайн и технологии","1.2 Практика по механической деревообработке",{"$nulls":4},"1.2 Практика по механической деревообработке","2.2 Механическая обработка швейного изделия или узла + Моделирование"]
["3 - Робототехника","1.3 Практика по ручной металлообработке",{"$nulls":4},"1.3 Практика по ручной металлообработке","2.3 Обработка швейного изделия или узла на швейно-вышивальном оборудовании + Моделирование"]
["4 - Информационная безопасность","1.4 Практика по механической металлообработке",{"$nulls":4},"1.4 Практика по механической металлообработке","2.4 3D-моделирование и печать"]
[null,"1.5 Электрорадиотехника",{"$nulls":4},"1.5 Электрорадиотехника","2.5 Практика по работе на лазерно-гравировальном станке"]
[null,"1.6 3D-моделирование и печать",{"$nulls":4},"1.6 3D-моделирование и печать","2.6 Промышленный дизайн"]
[null,"1.7 Практика по работе на лазерно-гравировальном станке",{"$nulls":4},"1.7 Практика по работе на лазерно-гравировальном станке"]
[null,"1.8 Промышленный дизайн",{"$nulls":4},"1.8 Промышленный дизайн"]
[null,"2.1 Ручная обработка швейного изделия или узла"]
[null,"2.2 Механическая обработка швейного изделия или узла + Моделирование",{"$nulls":6},"3.1 Робототехника","4.1 Не предусмотрена"]
[null,"2.3 Обработка швейного изделия или узла на швейно-вышивальном оборудовании + Моделирование"]
[null,"2.4 3D-моделирование и печать"]
[null,"2.5 Практика по работе на лазерно-гравировальном станке"]
[null,"2.6 Промышленный дизайн"]
[null,"3.1 Робототехника"]
[null,"4.1 Не предусмотрена"]
[]
[]
[]
[]
[]
["участник"]
["призер",null,"да","да",null,"м"]
["победитель",null,null,"нет",null,"ж"]

{"sheet":"Лист1","index":2,"n_rows":175,"n_cols":3,"rows_kept":175}
["Валиахметов Амир Наилевич","sma23520/edu160744/5/v8q57",{"$f":"VLOOKUP(B:B,Лист2!A:B,2,0)","v":0}]
["Габдуллина Ясмина Фанисовна","sma23520/edu160744/5/v9qr3",{"$f":"VLOOKUP(B:B,Лист2!A:B,2,0)","v":1}]
["Гайфутдинов Радмир Ирекович","sma23520/edu160744/5/v284z",{"$f":"VLOOKUP(B:B,Лист2!A:B,2,0)","v":2}]
["Гильфанова Эмилия Ленаровна","sma23520/edu160744/5/vq7wq",{"$f":"VLOOKUP(B:B,Лист2!A:B,2,0)","v":1}]
["Исхаков Амир Айратович","sma23520/edu160744/5/gw36r",{"$f":"VLOOKUP(B:B,Лист2!A:B,2,0)","v":4}]
["Малова Эльяна Николаевна","sma23520/edu160744/5/v32q2",{"$f":"VLOOKUP(B:B,Лист2!A:B,2,0)","v":{"$error":"#N/A"}}]
["Минибаева Амилия Айнуровна","sma23520/edu160744/5/v4499",{"$f":"VLOOKUP(B:B,Лист2!A:B,2,0)","v":{"$error":"#N/A"}}]
["Нафиков Данис Рамисович","sma23520/edu160744/5/gz88g",{"$f":"VLOOKUP(B:B,Лист2!A:B,2,0)","v":2}]
["Сулейманов Амир Ренатович","sma23520/edu160744/5/g5z4v",{"$f":"VLOOKUP(B:B,Лист2!A:B,2,0)","v":0}]
["Тухватуллина Альмира Рамилевна","sma23520/edu160744/5/g636v",{"$f":"VLOOKUP(B:B,Лист2!A:B,2,0)","v":2}]
["Фаттахов Йусуф Табрисович","sma23520/edu160744/5/g72wv",{"$f":"VLOOKUP(B:B,Лист2!A:B,2,0)","v":0}]
["Халиков Муса Айдарович","sma23520/edu160744/5/gr4wg",{"$f":"VLOOKUP(B:B,Лист2!A:B,2,0)","v":0}]
[" ","sma23520/edu160744/5/v887v",{"$f":"VLOOKUP(B:B,Лист2!A:B,2,0)","v":{"$error":"#N/A"}}]
["Халиуллин Данил Линарович","sma23520/edu160744/5/v973v",{"$f":"VLOOKUP(B:B,Лист2!A:B,2,0)","v":{"$error":"#N/A"}}]
["Хамидуллин Исмагил Наилевич","sma23520/edu160744/5/v29zg",{"$f":"VLOOKUP(B:B,Лист2!A:B,2,0)","v":{"$error":"#N/A"}}]
["Хаммадиев Айрат Маратович","sma23520/edu160744/5/vq5qv",{"$f":"VLOOKUP(B:B,Лист2!A:B,2,0)","v":0}]
["Хурматова Сайдель Ранилевна","sma23520/edu160744/5/gwzrv",{"$f":"VLOOKUP(B:B,Лист2!A:B,2,0)","v":0}]
["Галиев Азамат Айратович","sma23520/edu160744/5/v3r2g",{"$f":"VLOOKUP(B:B,Лист2!A:B,2,0)","v":0}]
["Гатин Самат Ленарович","sma23520/edu160744/5/v469v",{"$f":"VLOOKUP(B:B,Лист2!A:B,2,0)","v":4}]
["Зиятдинов Салават Ильшатович","sma23520/edu160744/5/gzz8g",{"$f":"VLOOKUP(B:B,Лист2!A:B,2,0)","v":{"$error":"#N/A"}}]
["Калимуллина Альбина Рафисовна","sma23520/edu160744/5/g544v",{"$f":"VLOOKUP(B:B,Лист2!A:B,2,0)","v":0}]
["Нафикова Динара Ильдаровна","sma23520/edu160744/5/g6q6v",{"$f":"VLOOKUP(B:B,Лист2!A:B,2,0)","v":1}]
["Сахаутдинова Амира Ратмировна","sma23520/edu160744/5/g7qwg",{"$f":"VLOOKUP(B:B,Лист2!A:B,2,0)","v":{"$error":"#N/A"}}]
["Суфиянов Расул Ильмирович","sma23520/edu160744/5/gr3wv",{"$f":"VLOOKUP(B:B,Лист2!A:B,2,0)","v":4}]
["Хадиева Илюза Ильшатовна","sma23520/edu160744/5/v897g",{"$f":"VLOOKUP(B:B,Лист2!A:B,2,0)","v":0}]
["Хакимов Нурислам Рамисович","sma23520/edu160744/5/v983g",{"$f":"VLOOKUP(B:B,Лист2!A:B,2,0)","v":1}]
["Харитонова Полина Александровна","sma23520/edu160744/5/v26zv",{"$f":"VLOOKUP(B:B,Лист2!A:B,2,0)","v":3}]
["Хусаенов Рамазан Ренатович","sma23520/edu160744/5/vq4qg",{"$f":"VLOOKUP(B:B,Лист2!A:B,2,0)","v":0}]
["Ахметов Данияз Алмазович","sma23520/edu160744/5/gw7rg",{"$f":"VLOOKUP(B:B,Лист2!A:B,2,0)","v":0}]
["Бикбова Диляра Азатовна","sma23520/edu160744/5/v352v",{"$f":"VLOOKUP(B:B,Лист2!A:B,2,0)","v":0}]
["Биктяшова Самира Юрьевна","sma23520/edu160744/5/v4z9v",{"$f":"VLOOKUP(B:B,Лист2!A:B,2,0)","v":1}]
["Гарифуллина Амиля Альбертовна","sma23520/edu160744/5/gz98v",{"$f":"VLOOKUP(B:B,Лист2!A:B,2,0)","v":0}]
["Зиннатуллина Инзиля Марселевна","sma23520/edu160744/5/g574g",{"$f":"VLOOKUP(B:B,Лист2!A:B,2,0)","v":{"$error":"#N/A"}}]
["Иль Альберт Юрьевич","sma23520/edu160744/5/g666g",{"$f":"VLOOKUP(B:B,Лист2!A:B,2,0)","v":{"$error":"#N/A"}}]
["Камасин Самир Рушанович","sma23520/edu160744/5/g75wg",{"$f":"VLOOKUP(B:B,Лист2!A:B,2,0)","v":{"$error":"#N/A"}}]
["Мубаракшина Регина Рамисовна","sma23520/edu160744/5/gr8wg",{"$f":"VLOOKUP(B:B,Лист2!A:B,2,0)","v":2}]
["Набиева Алия Нургаязовна","sma23520/edu160744/5/v8z7v",{"$f":"VLOOKUP(B:B,Лист2!A:B,2,0)","v":0}]
["Набиева Зарина Руслановна","sma23520/edu160744/5/v943g",{"$f":"VLOOKUP(B:B,Лист2!A:B,2,0)","v":1}]
[" ","sma23520/edu160744/5/v2qzg",{"$f":"VLOOKUP(B:B,Лист2!A:B,2,0)","v":0}]
["Уразайкина Диана Артуровна","sma23520/edu160744/5/vq9qv",{"$f":"VLOOKUP(B:B,Лист2!A:B,2,0)","v":{"$error":"#N/A"}}]
["Хакимова Руфина Динаровна","sma23520/edu160744/5/gwqrg",{"$f":"VLOOKUP(B:B,Лист2!A:B,2,0)","v":1}]
["Шамилова Дилия Маратовна","sma23520/edu160744/5/v382g",{"$f":"VLOOKUP(B:B,Лист2!A:B,2,0)","v":{"$error":"#N/A"}}]
["Федоров Тимур Александрович","sma23520/edu160744/5/v4r9v",{"$f":"VLOOKUP(B:B,Лист2!A:B,2,0)","v":{"$error":"#N/A"}}]
["Алексеева Маргарита Денисовна","sma23520/edu160744/5/gzr8g",{"$f":"VLOOKUP(B:B,Лист2!A:B,2,0)","v":2}]
["Вилданов Наиль Маратович","sma23520/edu160744/5/g554g",{"$f":"VLOOKUP(B:B,Лист2!A:B,2,0)","v":0}]
["Шафиков Амир Айратович","sma23520/edu160744/5/g6z6g",{"$f":"VLOOKUP(B:B,Лист2!A:B,2,0)","v":3}]
[" ","sma23520/edu160744/5/g7wwg",{"$f":"VLOOKUP(B:B,Лист2!A:B,2,0)","v":0}]
[" ","sma23520/edu160744/5/grrwg",{"$f":"VLOOKUP(B:B,Лист2!A:B,2,0)","v":1}]
["Абдеев Малик  Рамилевич","sma23620/edu160744/6/gr75v",{"$f":"VLOOKUP(B:B,Лист2!A:B,2,0)","v":{"$error":"#N/A"}}]
["Амирханова Сюмбель  Гумеровна","sma23620/edu160744/6/v843v",{"$f":"VLOOKUP(B:B,Лист2!A:B,2,0)","v":{"$error":"#N/A"}}]
["Ахмадеева Зарина   Айдаровна","sma23620/edu160744/6/v93qv",{"$f":"VLOOKUP(B:B,Лист2!A:B,2,0)","v":1}]
["Бадртдинов Инсаф  Ильдусович","sma23620/edu160744/6/v224v",{"$f":"VLOOKUP(B:B,Лист2!A:B,2,0)","v":0}]
["Вагизова Амиля  Тимуровна","sma23620/edu160744/6/vq25g",{"$f":"VLOOKUP(B:B,Лист2!A:B,2,0)","v":{"$error":"#N/A"}}]
["Гайнуллина Алия  Айратовна","sma23620/edu160744/6/gw87v",{"$f":"VLOOKUP(B:B,Лист2!A:B,2,0)","v":{"$error":"#N/A"}}]
["Гайнутдинов Дамир  Ниязович","sma23620/edu160744/6/v3z8g",{"$f":"VLOOKUP(B:B,Лист2!A:B,2,0)","v":{"$error":"#N/A"}}]
["Гасимова Алина  Ильнуровна","sma23620/edu160744/6/v4wqg",{"$f":"VLOOKUP(B:B,Лист2!A:B,2,0)","v":6}]
["Гизетдинова Рияна  Риналовна","sma23620/edu160744/6/gz34v",{"$f":"VLOOKUP(B:B,Лист2!A:B,2,0)","v":{"$error":"#N/A"}}]
["Гилязова Айзиля  Айратовна","sma23620/edu160744/6/g529v",{"$f":"VLOOKUP(B:B,Лист2!A:B,2,0)","v":{"$error":"#N/A"}}]
["Добрынина Дарья Евгеньевна","sma23620/edu160744/6/g697v",{"$f":"VLOOKUP(B:B,Лист2!A:B,2,0)","v":{"$error":"#N/A"}}]
["Идиатуллин Самир  Ильгизарович","sma23620/edu160744/6/g788v",{"$f":"VLOOKUP(B:B,Лист2!A:B,2,0)","v":{"$error":"#N/A"}}]
{"$rows_left_out":116}
{"sheet":"Лист2","index":3,"n_rows":149,"n_cols":2,"rows_kept":149}
["sma23520/edu160744/5/v469v",4]
["sma23520/edu160744/5/gr3wv",4]
["sma23520/edu160744/5/gw36r",4]
["sma23520/edu160744/5/v26zv",3]
["sma23520/edu160744/5/g6z6g",3]
["sma23520/edu160744/5/g636v",2]
["sma23520/edu160744/5/gr8wg",2]
["sma23520/edu160744/5/gzr8g",2]
["sma23520/edu160744/5/v284z",2]
["sma23520/edu160744/5/gz88g",2]
["sma23520/edu160744/5/gwqrg",1]
["sma23520/edu160744/5/v9qr3",1]
["sma23520/edu160744/5/vq7wq",1]
["sma23520/edu160744/5/v983g",1]
["sma23520/edu160744/5/g6q6v",1]
["sma23520/edu160744/5/grrwg",1]
["sma23520/edu160744/5/v943g",1]
["sma23520/edu160744/5/v4z9v",1]
["sma23520/edu160744/5/gz98v",0]
["sma23520/edu160744/5/gwzrv",0]
["sma23520/edu160744/5/vq4qg",0]
["sma23520/edu160744/5/v3r2g",0]
["sma23520/edu160744/5/g7wwg",0]
["sma23520/edu160744/5/v2qzg",0]
["sma23520/edu160744/5/v8q57",0]
["sma23520/edu160744/5/v352v",0]
["sma23520/edu160744/5/g544v",0]
["sma23520/edu160744/5/v897g",0]
["sma23520/edu160744/5/g554g",0]
["sma23520/edu160744/5/g5z4v",0]
["sma23520/edu160744/5/v8z7v",0]
["sma23520/edu160744/5/g72wv",0]
["sma23520/edu160744/5/gw7rg",0]
["sma23520/edu160744/5/vq5qv",0]
["sma23520/edu160744/5/gr4wg",0]
["sma23620/edu160744/6/v4wqg",6]
["sma23620/edu160744/6/v833g",5]
["sma23620/edu160744/6/vq65g",4]
["sma23620/edu160744/6/g768v",3]
["sma23620/edu160744/6/g5w9g",2]
["sma23620/edu160744/6/v338v",2]
["sma23620/edu160744/6/vq75v",2]
["sma23620/edu160744/6/v45qg",2]
["sma23620/edu160744/6/gr25g",2]
["sma23620/edu160744/6/gw37g",2]
["sma23620/edu160744/6/v3w8v",1]
["sma23620/edu160744/6/gr95v",1]
["sma23620/edu160744/6/v863v",1]
["sma23620/edu160744/6/g738g",1]
["sma23620/edu160744/6/vqq5v",1]
["sma23620/edu160744/6/gw47v",1]
["sma23620/edu160744/6/v9zqg",1]
["sma23620/edu160744/6/grq5v",1]
["sma23620/edu160744/6/gz64g",1]
["sma23620/edu160744/6/g798g",1]
["sma23620/edu160744/6/v93qv",1]
["sma23620/edu160744/6/v9wqv",1]
["sma23620/edu160744/6/v224v",0]
["sma23620/edu160744/6/v2w4g",0]
["sma23620/edu160744/6/v47qg",0]
{"$rows_left_out":89}